1.11.0 и 1.11.1 не собираются под Debian testing (stretch)

Compilation and installation questions and stories
Post Reply
denk20
Posts: 3
Joined: 24 Aug 2015, 12:15

1.11.0 и 1.11.1 не собираются под Debian testing (stretch)

Post by denk20 » 12 Jan 2017, 13:58

Code: Select all

[  6%] Built target triton
[ 34%] Built target accel-pppd
[ 41%] Built target radius
[ 43%] Built target vlan-mon
[ 44%] Built target pptp
[ 49%] Built target pppoe
[ 52%] Built target l2tp
[ 58%] Built target ipoe
[ 60%] Built target auth_mschap_v2
[ 62%] Built target auth_chap_md5
[ 63%] Built target auth_pap
[ 64%] Built target auth_mschap_v1
[ 65%] Built target log_tcp
[ 66%] Built target log_file
[ 68%] Built target log_syslog
[ 69%] Built target ipv6pool
[ 71%] Built target ippool
[ 73%] Built target sigchld
[ 75%] Built target pppd_compat
[ 77%] Built target connlimit
[ 78%] Building C object accel-pppd/extra/CMakeFiles/chap-secrets.dir/chap-secrets.c.o
/usr/src/accel-ppp-1.11.0/accel-pppd/extra/chap-secrets.c: In function ‘create_pd’:
/usr/src/accel-ppp-1.11.0/accel-pppd/extra/chap-secrets.c:132:13: error: storage size of ‘md_ctx’ isn’t known
  EVP_MD_CTX md_ctx;
             ^~~~~~
/usr/src/accel-ppp-1.11.0/accel-pppd/extra/chap-secrets.c:147:4: warning: implicit declaration of function ‘EVP_MD_CTX_cleanup’ [-Wimplicit-function-declaration]
    EVP_MD_CTX_cleanup(&md_ctx);
    ^~~~~~~~~~~~~~~~~~
/usr/src/accel-ppp-1.11.0/accel-pppd/extra/chap-secrets.c:132:13: warning: unused variable ‘md_ctx’ [-Wunused-variable]
  EVP_MD_CTX md_ctx;
             ^~~~~~
accel-pppd/extra/CMakeFiles/chap-secrets.dir/build.make:62: ошибка выполнения рецепта для цели «accel-pppd/extra/CMakeFiles/chap-secrets.dir/chap-secrets.c.o»
make[2]: *** [accel-pppd/extra/CMakeFiles/chap-secrets.dir/chap-secrets.c.o] Ошибка 1
CMakeFiles/Makefile2:1082: ошибка выполнения рецепта для цели «accel-pppd/extra/CMakeFiles/chap-secrets.dir/all»
make[1]: *** [accel-pppd/extra/CMakeFiles/chap-secrets.dir/all] Ошибка 2
Makefile:149: ошибка выполнения рецепта для цели «all»
make: *** [all] Ошибка 2
Зависимости удовлетворены. В чем может быть проблема?

Dmitry
Администратор
Posts: 949
Joined: 09 Oct 2014, 10:06

Re: 1.11.0 и 1.11.1 не собираются под Debian testing (stretch)

Post by Dmitry » 12 Jan 2017, 15:14

видимо в openssl что-то поменялось

hugleo
Posts: 58
Joined: 13 Apr 2016, 14:28

Re: 1.11.0 и 1.11.1 не собираются под Debian testing (stretch)

Post by hugleo » 17 Jan 2017, 19:15

just install libssl1.0-dev package and you are good to go.

zavndw
Posts: 10
Joined: 20 Feb 2017, 04:57

Re: 1.11.0 и 1.11.1 не собираются под Debian testing (stretch)

Post by zavndw » 29 Jun 2017, 03:03

Добрый день. У меня аналогичная проблема, при сборке получаю ошибку

Code: Select all

Scanning dependencies of target connlimit
[ 81%] Building C object accel-pppd/extra/CMakeFiles/connlimit.dir/connlimit.c.o
[ 82%] Linking C shared library libconnlimit.so
[ 82%] Built target connlimit
Scanning dependencies of target sigchld
[ 83%] Building C object accel-pppd/extra/CMakeFiles/sigchld.dir/sigchld.c.o
[ 83%] Linking C shared library libsigchld.so
[ 83%] Built target sigchld
Scanning dependencies of target pppd_compat
[ 84%] Building C object accel-pppd/extra/CMakeFiles/pppd_compat.dir/pppd_compat.c.o
[ 85%] Linking C shared library libpppd_compat.so
[ 85%] Built target pppd_compat
Scanning dependencies of target ipv6pool
[ 86%] Building C object accel-pppd/extra/CMakeFiles/ipv6pool.dir/ipv6pool.c.o
[ 86%] Linking C shared library libipv6pool.so
[ 86%] Built target ipv6pool
Scanning dependencies of target ippool
[ 87%] Building C object accel-pppd/extra/CMakeFiles/ippool.dir/ippool.c.o
/tmp/makepkg/accel-ppp/src/accel-ppp-1.11.1/accel-pppd/extra/ippool.c: In function ‘ippool_init2’:
/tmp/makepkg/accel-ppp/src/accel-ppp-1.11.1/accel-pppd/extra/ippool.c:616:5: warning: ‘generate’ may be
used uninitialized in this function [-Wmaybe-uninitialized]
     add_range(p, &p->tunnel_list, opt->val, generate);
     ^~~~~~~~~~~~~~~~~~~~~~~~~~~~~~~~~~~~~~~~~~~~~~~~~
[ 88%] Linking C shared library libippool.so
[ 88%] Built target ippool
Scanning dependencies of target chap-secrets
[ 89%] Building C object accel-pppd/extra/CMakeFiles/chap-secrets.dir/chap-secrets.c.o
/tmp/makepkg/accel-ppp/src/accel-ppp-1.11.1/accel-pppd/extra/chap-secrets.c: In function ‘create_pd’:
/tmp/makepkg/accel-ppp/src/accel-ppp-1.11.1/accel-pppd/extra/chap-secrets.c:132:13: error: storage size
of ‘md_ctx’ isn’t known
  EVP_MD_CTX md_ctx;
             ^~~~~~
/tmp/makepkg/accel-ppp/src/accel-ppp-1.11.1/accel-pppd/extra/chap-secrets.c:147:4: warning: implicit declaration of function ‘EVP_MD_CTX_cleanup’; did you mean ‘EVP_MD_CTX_create’? [-Wimplicit-function-declaration]
    EVP_MD_CTX_cleanup(&md_ctx);
    ^~~~~~~~~~~~~~~~~~
    EVP_MD_CTX_create
/tmp/makepkg/accel-ppp/src/accel-ppp-1.11.1/accel-pppd/extra/chap-secrets.c:132:13: warning: unused variable ‘md_ctx’ [-Wunused-variable]
  EVP_MD_CTX md_ctx;
             ^~~~~~
make[2]: *** [accel-pppd/extra/CMakeFiles/chap-secrets.dir/build.make:63: accel-pppd/extra/CMakeFiles/chap-secrets.dir/chap-secrets.c.o] Error 1
make[1]: *** [CMakeFiles/Makefile2:1081: accel-pppd/extra/CMakeFiles/chap-secrets.dir/all] Error 2
make: *** [Makefile:152: all] Error 2
==> ERROR: A failure occurred in build().
    Aborting...
LANG=en_US.UTF-8 makepkg -c  28,83s user 2,45s system 95% cpu 32,817 total

~/build/accel-ppp
Собираю на archlinux, есть пакет openssl а есть openssl-1.0 мес 4 назад перестал собиратся как появился второй пакет, пути меняли не помогает


Post Reply

Who is online

Users browsing this forum: No registered users and 1 guest