1.11.2 не собираются на последнем Archlinux с опцией сборики -DSHAPER=TRUE

Compilation and installation questions and stories
Post Reply
4le34n
Posts: 10
Joined: 29 Jun 2017, 06:15

1.11.2 не собираются на последнем Archlinux с опцией сборики -DSHAPER=TRUE

Post by 4le34n » 22 Sep 2017, 05:39

1.11.2 не собираются на последнем Archlinux с опцией сборики -DSHAPER=TRUE
Если передать опции сборки с -DSHAPER=FALSE, то сборка проходит успешно. С git версией тоже самое.
gcc:

Code: Select all

sh-4.4$ LANG=en gcc -v
Using built-in specs.
COLLECT_GCC=gcc
COLLECT_LTO_WRAPPER=/usr/lib/gcc/x86_64-pc-linux-gnu/7.2.0/lto-wrapper
Target: x86_64-pc-linux-gnu
Configured with: /build/gcc/src/gcc/configure --prefix=/usr --libdir=/usr/lib --libexecdir=/usr/lib --mandir=/usr/share/man --infodir=/usr/share/info --with-bugurl=https://bugs.archlinux.org/ --enable-languages=c,c++,ada,fortran,go,lto,objc,obj-c++ --enable-shared --enable-threads=posix --enable-libmpx --with-system-zlib --with-isl --enable-__cxa_atexit --disable-libunwind-exceptions --enable-clocale=gnu --disable-libstdcxx-pch --disable-libssp --enable-gnu-unique-object --enable-linker-build-id --enable-lto --enable-plugin --enable-install-libiberty --with-linker-hash-style=gnu --enable-gnu-indirect-function --disable-multilib --disable-werror --enable-checking=release --enable-default-pie --enable-default-ssp
Thread model: posix
gcc version 7.2.0 (GCC)
ядро:

Code: Select all

sh-4.4$ uname -a
Linux LocalHost 4.9.51-1-lts #1 SMP Wed Sep 20 14:50:36 CEST 2017 x86_64 GNU/Linux
сборка:

Code: Select all

sh-4.4$ LANG=en_US.UTF-8 makepkg -cf
==> Making package: accel-ppp 1.11.2-1 (Fri Sep 22 16:24:37 +11 2017)
==> Checking runtime dependencies...
==> Checking buildtime dependencies...
==> Retrieving sources...
  -> Found accel-ppp-1.11.2.tar.bz2
  -> Found accel-ppp.logrotate
  -> Found accel-ppp.lua
  -> Found accel-ppp.tmpfiles
  -> Found accel-pppd.service
  -> Found dictionary.abills
  -> Found dictionary.accel_ipoe
==> Validating source files with md5sums...
    accel-ppp-1.11.2.tar.bz2 ... Passed
    accel-ppp.logrotate ... Passed
    accel-ppp.lua ... Passed
    accel-ppp.tmpfiles ... Passed
    accel-pppd.service ... Passed
    dictionary.abills ... Passed
    dictionary.accel_ipoe ... Passed
==> Extracting sources...
  -> Extracting accel-ppp-1.11.2.tar.bz2 with bsdtar
==> Starting prepare()...
==> Starting build()...
CMake Deprecation Warning at CMakeLists.txt:3 (cmake_policy):
  The OLD behavior for policy CMP0003 will be removed from a future version
  of CMake.

  The cmake-policies(7) manual explains that the OLD behaviors of all
  policies are deprecated and that a policy should be set to OLD only under
  specific short-term circumstances.  Projects should be ported to the NEW
  behavior and not rely on setting a policy to OLD.


-- The C compiler identification is GNU 7.2.0
-- Check for working C compiler: /usr/bin/cc
-- Check for working C compiler: /usr/bin/cc -- works
-- Detecting C compiler ABI info
-- Detecting C compiler ABI info - done
-- Detecting C compile features
-- Detecting C compile features - done
-- 'x86_64'
-- Looking for timerfd_create
-- Looking for timerfd_create - found
-- Found Lua51: /usr/lib/liblua5.1.so;/usr/lib/libm.so (found version "5.1.5")
-- Looking for linux/netfilter/ipset/ip_set.h
-- Looking for linux/netfilter/ipset/ip_set.h - found
-- Configuring done
-- Generating done
-- Build files have been written to: /tmp/makepkg/accel-ppp/src/accel-ppp-1.11.2/build
Scanning dependencies of target triton
Scanning dependencies of target vlan-mon
Scanning dependencies of target radius
[  1%] Building C object accel-pppd/vlan-mon/CMakeFiles/vlan-mon.dir/vlan_mon.c.o
[  2%] Building C object accel-pppd/triton/CMakeFiles/triton.dir/md.c.o
[  2%] Building C object accel-pppd/radius/CMakeFiles/radius.dir/stat_accm.c.o
[  3%] Building C object accel-pppd/radius/CMakeFiles/radius.dir/dict.c.o
[  4%] Building C object accel-pppd/triton/CMakeFiles/triton.dir/timer.c.o
[  5%] Linking C shared library libvlan-mon.so
[  5%] Built target vlan-mon
Scanning dependencies of target pptp
[  6%] Building C object accel-pppd/ctrl/pptp/CMakeFiles/pptp.dir/pptp.c.o
[  7%] Building C object accel-pppd/triton/CMakeFiles/triton.dir/triton.c.o
[  8%] Building C object accel-pppd/radius/CMakeFiles/radius.dir/req.c.o
[  9%] Building C object accel-pppd/triton/CMakeFiles/triton.dir/conf_file.c.o
[ 10%] Building C object accel-pppd/radius/CMakeFiles/radius.dir/packet.c.o
[ 11%] Building C object accel-pppd/triton/CMakeFiles/triton.dir/loader.c.o
[ 12%] Linking C shared library libpptp.so
[ 12%] Built target pptp
Scanning dependencies of target pppoe
[ 13%] Building C object accel-pppd/ctrl/pppoe/CMakeFiles/pppoe.dir/pppoe.c.o
[ 14%] Building C object accel-pppd/radius/CMakeFiles/radius.dir/auth.c.o
[ 14%] Building C object accel-pppd/triton/CMakeFiles/triton.dir/log.c.o
[ 15%] Building C object accel-pppd/triton/CMakeFiles/triton.dir/mempool.c.o
[ 16%] Building C object accel-pppd/triton/CMakeFiles/triton.dir/event.c.o
[ 16%] Building C object accel-pppd/radius/CMakeFiles/radius.dir/acct.c.o
[ 17%] Linking C shared library libtriton.so
[ 17%] Built target triton
Scanning dependencies of target l2tp
[ 18%] Building C object accel-pppd/ctrl/l2tp/CMakeFiles/l2tp.dir/l2tp.c.o
[ 19%] Building C object accel-pppd/radius/CMakeFiles/radius.dir/serv.c.o
[ 20%] Building C object accel-pppd/radius/CMakeFiles/radius.dir/dm_coa.c.o
[ 21%] Building C object accel-pppd/radius/CMakeFiles/radius.dir/radius.c.o
[ 22%] Linking C shared library libradius.so
[ 22%] Built target radius
Scanning dependencies of target ipoe
[ 23%] Building C object accel-pppd/ctrl/ipoe/CMakeFiles/ipoe.dir/ipoe.c.o
[ 23%] Building C object accel-pppd/ctrl/l2tp/CMakeFiles/l2tp.dir/dict.c.o
[ 24%] Building C object accel-pppd/ctrl/l2tp/CMakeFiles/l2tp.dir/packet.c.o
[ 25%] Linking C shared library libl2tp.so
[ 25%] Built target l2tp
Scanning dependencies of target auth_chap_md5
[ 26%] Building C object accel-pppd/auth/CMakeFiles/auth_chap_md5.dir/auth_chap_md5.c.o
[ 27%] Linking C shared library libauth_chap_md5.so
[ 28%] Building C object accel-pppd/ctrl/ipoe/CMakeFiles/ipoe.dir/dhcpv4.c.o
[ 28%] Built target auth_chap_md5
Scanning dependencies of target auth_pap
[ 29%] Building C object accel-pppd/auth/CMakeFiles/auth_pap.dir/auth_pap.c.o
[ 30%] Linking C shared library libauth_pap.so
[ 30%] Built target auth_pap
[ 32%] Building C object accel-pppd/ctrl/pppoe/CMakeFiles/pppoe.dir/dpado.c.o
[ 32%] Building C object accel-pppd/ctrl/pppoe/CMakeFiles/pppoe.dir/mac_filter.c.o
Scanning dependencies of target auth_mschap_v1
[ 33%] Building C object accel-pppd/auth/CMakeFiles/auth_mschap_v1.dir/auth_mschap_v1.c.o
[ 33%] Building C object accel-pppd/ctrl/ipoe/CMakeFiles/ipoe.dir/dhcpv4_options.c.o
[ 33%] Linking C shared library libauth_mschap_v1.so
[ 34%] Building C object accel-pppd/ctrl/ipoe/CMakeFiles/ipoe.dir/ipoe_netlink.c.o
[ 34%] Built target auth_mschap_v1
Scanning dependencies of target auth_mschap_v2
[ 35%] Building C object accel-pppd/auth/CMakeFiles/auth_mschap_v2.dir/auth_mschap_v2.c.o
[ 36%] Building C object accel-pppd/ctrl/ipoe/CMakeFiles/ipoe.dir/arp.c.o
[ 37%] Building C object accel-pppd/ctrl/ipoe/CMakeFiles/ipoe.dir/lua.c.o
[ 38%] Linking C shared library libauth_mschap_v2.so
[ 38%] Built target auth_mschap_v2
[ 39%] Building C object accel-pppd/ctrl/ipoe/CMakeFiles/ipoe.dir/lua_lpack.c.o
[ 39%] Building C object accel-pppd/ctrl/pppoe/CMakeFiles/pppoe.dir/cli.c.o
Scanning dependencies of target log_tcp
[ 40%] Building C object accel-pppd/logs/CMakeFiles/log_tcp.dir/log_tcp.c.o
[ 41%] Linking C shared library liblog_tcp.so
[ 41%] Built target log_tcp
[ 42%] Building C object accel-pppd/ctrl/pppoe/CMakeFiles/pppoe.dir/disc.c.o
[ 43%] Building C object accel-pppd/ctrl/ipoe/CMakeFiles/ipoe.dir/lua_bit.c.o
[ 44%] Building C object accel-pppd/ctrl/pppoe/CMakeFiles/pppoe.dir/tr101.c.o
Scanning dependencies of target log_file
[ 44%] Linking C shared library libipoe.so
[ 45%] Building C object accel-pppd/logs/CMakeFiles/log_file.dir/log_file.c.o
[ 46%] Linking C shared library libpppoe.so
[ 46%] Built target ipoe
Scanning dependencies of target log_syslog
[ 46%] Building C object accel-pppd/logs/CMakeFiles/log_syslog.dir/log_syslog.c.o
[ 46%] Built target pppoe
Scanning dependencies of target connlimit
[ 47%] Building C object accel-pppd/extra/CMakeFiles/connlimit.dir/connlimit.c.o
[ 48%] Linking C shared library liblog_syslog.so
[ 48%] Built target log_syslog
Scanning dependencies of target sigchld
[ 49%] Linking C shared library libconnlimit.so
[ 50%] Building C object accel-pppd/extra/CMakeFiles/sigchld.dir/sigchld.c.o
[ 51%] Linking C shared library liblog_file.so
[ 51%] Built target connlimit
Scanning dependencies of target ipv6pool
[ 51%] Built target log_file
[ 52%] Building C object accel-pppd/extra/CMakeFiles/ipv6pool.dir/ipv6pool.c.o
Scanning dependencies of target ippool
[ 52%] Linking C shared library libsigchld.so
[ 53%] Building C object accel-pppd/extra/CMakeFiles/ippool.dir/ippool.c.o
[ 53%] Built target sigchld
Scanning dependencies of target chap-secrets
[ 53%] Building C object accel-pppd/extra/CMakeFiles/chap-secrets.dir/chap-secrets.c.o
/tmp/makepkg/accel-ppp/src/accel-ppp-1.11.2/accel-pppd/extra/ippool.c: In function ‘ippool_init2’:
/tmp/makepkg/accel-ppp/src/accel-ppp-1.11.2/accel-pppd/extra/ippool.c:614:5: warning: ‘generate’ may be used uninitialized in this function [-Wmaybe-uninitialized]
     add_range(p, &p->gw_list, opt->val, generate);
     ^~~~~~~~~~~~~~~~~~~~~~~~~~~~~~~~~~~~~~~~~~~~~
[ 54%] Linking C shared library libipv6pool.so
[ 54%] Built target ipv6pool
Scanning dependencies of target logwtmp
[ 55%] Building C object accel-pppd/extra/CMakeFiles/logwtmp.dir/logwtmp.c.o
[ 56%] Linking C shared library libippool.so
[ 57%] Linking C shared library liblogwtmp.so
[ 57%] Built target ippool
Scanning dependencies of target ipv6_dhcp
[ 58%] Building C object accel-pppd/ipv6/CMakeFiles/ipv6_dhcp.dir/dhcpv6.c.o
[ 58%] Built target logwtmp
[ 59%] Building C object accel-pppd/ipv6/CMakeFiles/ipv6_dhcp.dir/dhcpv6_packet.c.o
[ 60%] Linking C shared library libchap-secrets.so
Scanning dependencies of target ipv6_nd
[ 60%] Built target chap-secrets
[ 61%] Building C object accel-pppd/ipv6/CMakeFiles/ipv6_nd.dir/nd.c.o
Scanning dependencies of target shaper
[ 62%] Building C object accel-pppd/shaper/CMakeFiles/shaper.dir/shaper.c.o
[ 62%] Linking C shared library libipv6_dhcp.so
[ 62%] Built target ipv6_dhcp
Scanning dependencies of target accel-cmd
[ 62%] Building C object accel-cmd/CMakeFiles/accel-cmd.dir/accel_cmd.c.o
/tmp/makepkg/accel-ppp/src/accel-ppp-1.11.2/accel-cmd/accel_cmd.c: In function ‘accel_talk’:
/tmp/makepkg/accel-ppp/src/accel-ppp-1.11.2/accel-cmd/accel_cmd.c:218:7: warning: ‘last_char’ may be used uninitialized in this function [-Wmaybe-uninitialized]
    if (last_char == '\n') {
       ^
[ 63%] Linking C shared library libipv6_nd.so
[ 63%] Built target ipv6_nd
Scanning dependencies of target accel-pppd
[ 64%] Linking C executable accel-cmd
[ 65%] Building C object accel-pppd/CMakeFiles/accel-pppd.dir/memdebug.c.o
[ 65%] Built target accel-cmd
Scanning dependencies of target pppd_compat
[ 65%] Building C object accel-pppd/extra/CMakeFiles/pppd_compat.dir/pppd_compat.c.o
[ 65%] Building C object accel-pppd/shaper/CMakeFiles/shaper.dir/limiter.c.o
[ 66%] Building C object accel-pppd/CMakeFiles/accel-pppd.dir/session.c.o
/tmp/makepkg/accel-ppp/src/accel-ppp-1.11.2/accel-pppd/shaper/limiter.c: In function ‘install_limiter’:
/tmp/makepkg/accel-ppp/src/accel-ppp-1.11.2/accel-pppd/shaper/limiter.c:497:9: warning: ‘r’ may be used uninitialized in this function [-Wmaybe-uninitialized]
  return r;
         ^
[ 67%] Building C object accel-pppd/shaper/CMakeFiles/shaper.dir/leaf_qdisc.c.o
[ 68%] Linking C shared library libpppd_compat.so
[ 68%] Built target pppd_compat
[ 69%] Building C object accel-pppd/CMakeFiles/accel-pppd.dir/session_backup.c.o
[ 69%] Building C object accel-pppd/CMakeFiles/accel-pppd.dir/ifcfg.c.o
[ 70%] Building C object accel-pppd/CMakeFiles/accel-pppd.dir/net.c.o
[ 71%] Building C object accel-pppd/shaper/CMakeFiles/shaper.dir/tc_core.c.o
[ 72%] Building C object accel-pppd/CMakeFiles/accel-pppd.dir/backup/backup.c.o
/tmp/makepkg/accel-ppp/src/accel-ppp-1.11.2/accel-pppd/shaper/tc_core.c: In function ‘tc_calc_size_table’:
/tmp/makepkg/accel-ppp/src/accel-ppp-1.11.2/accel-pppd/shaper/tc_core.c:173:29: error: ‘UINT16_MAX’ undeclared (first use in this function); did you mean ‘__INT16_MAX__’?
   if ((sz >> s->size_log) > UINT16_MAX) {
                             ^~~~~~~~~~
                             __INT16_MAX__
/tmp/makepkg/accel-ppp/src/accel-ppp-1.11.2/accel-pppd/shaper/tc_core.c:173:29: note: each undeclared identifier is reported only once for each function it appears in
make[2]: *** [accel-pppd/shaper/CMakeFiles/shaper.dir/build.make:135: accel-pppd/shaper/CMakeFiles/shaper.dir/tc_core.c.o] Error 1
make[1]: *** [CMakeFiles/Makefile2:1267: accel-pppd/shaper/CMakeFiles/shaper.dir/all] Error 2
make[1]: *** Waiting for unfinished jobs....
[ 73%] Building C object accel-pppd/CMakeFiles/accel-pppd.dir/ppp/ppp.c.o
[ 74%] Building C object accel-pppd/CMakeFiles/accel-pppd.dir/ppp/ppp_fsm.c.o
[ 75%] Building C object accel-pppd/CMakeFiles/accel-pppd.dir/ppp/ppp_lcp.c.o
/tmp/makepkg/accel-ppp/src/accel-ppp-1.11.2/accel-pppd/ppp/ppp_lcp.c: In function ‘lcp_recv’:
/tmp/makepkg/accel-ppp/src/accel-ppp-1.11.2/accel-pppd/ppp/ppp_lcp.c:820:4: warning: this ‘else’ clause does not guard... [-Wmisleading-indentation]
    else
    ^~~~
/tmp/makepkg/accel-ppp/src/accel-ppp-1.11.2/accel-pppd/ppp/ppp_lcp.c:823:5: note: ...this statement, but the latter is misleadingly indented as if it were guarded by the ‘else’
     ppp_fsm_recv_conf_ack(&lcp->fsm);
     ^~~~~~~~~~~~~~~~~~~~~
/tmp/makepkg/accel-ppp/src/accel-ppp-1.11.2/accel-pppd/ppp/ppp_lcp.c:834:4: warning: this ‘else’ clause does not guard... [-Wmisleading-indentation]
    else
    ^~~~
/tmp/makepkg/accel-ppp/src/accel-ppp-1.11.2/accel-pppd/ppp/ppp_lcp.c:837:5: note: ...this statement, but the latter is misleadingly indented as if it were guarded by the ‘else’
     ppp_fsm_recv_conf_rej(&lcp->fsm);
     ^~~~~~~~~~~~~~~~~~~~~
[ 75%] Building C object accel-pppd/CMakeFiles/accel-pppd.dir/ppp/lcp_opt_mru.c.o
[ 76%] Building C object accel-pppd/CMakeFiles/accel-pppd.dir/ppp/lcp_opt_magic.c.o
[ 77%] Building C object accel-pppd/CMakeFiles/accel-pppd.dir/ppp/lcp_opt_pcomp.c.o
[ 78%] Building C object accel-pppd/CMakeFiles/accel-pppd.dir/ppp/lcp_opt_accomp.c.o
[ 79%] Building C object accel-pppd/CMakeFiles/accel-pppd.dir/ppp/ppp_auth.c.o
[ 79%] Building C object accel-pppd/CMakeFiles/accel-pppd.dir/ppp/ppp_ipcp.c.o
[ 80%] Building C object accel-pppd/CMakeFiles/accel-pppd.dir/ppp/ipcp_opt_ipaddr.c.o
[ 81%] Building C object accel-pppd/CMakeFiles/accel-pppd.dir/ppp/ipcp_opt_dns.c.o
[ 82%] Building C object accel-pppd/CMakeFiles/accel-pppd.dir/ppp/ipcp_opt_wins.c.o
[ 83%] Building C object accel-pppd/CMakeFiles/accel-pppd.dir/ppp/ipv6cp_opt_intfid.c.o
[ 84%] Building C object accel-pppd/CMakeFiles/accel-pppd.dir/ppp/ppp_ipv6cp.c.o
[ 84%] Building C object accel-pppd/CMakeFiles/accel-pppd.dir/ppp/ppp_ccp.c.o
[ 85%] Building C object accel-pppd/CMakeFiles/accel-pppd.dir/ppp/ccp_mppe.c.o
[ 86%] Building C object accel-pppd/CMakeFiles/accel-pppd.dir/cli/std_cmd.c.o
[ 87%] Building C object accel-pppd/CMakeFiles/accel-pppd.dir/cli/show_sessions.c.o
[ 88%] Building C object accel-pppd/CMakeFiles/accel-pppd.dir/cli/telnet.c.o
/tmp/makepkg/accel-ppp/src/accel-ppp-1.11.2/accel-pppd/cli/show_sessions.c: In function ‘print_uptime’:
/tmp/makepkg/accel-ppp/src/accel-ppp-1.11.2/accel-pppd/cli/show_sessions.c:442:26: warning: ‘snprintf’ output may be truncated before the last format character [-Wformat-truncation=]
   snprintf(time_str, 13, "%i.%02i:%02i:%02i", day, hour, min, sec);
                          ^~~~~~~~~~~~~~~~~~~
/tmp/makepkg/accel-ppp/src/accel-ppp-1.11.2/accel-pppd/cli/show_sessions.c:442:3: note: ‘snprintf’ output between 11 and 24 bytes into a destination of size 13
   snprintf(time_str, 13, "%i.%02i:%02i:%02i", day, hour, min, sec);
   ^~~~~~~~~~~~~~~~~~~~~~~~~~~~~~~~~~~~~~~~~~~~~~~~~~~~~~~~~~~~~~~~
[ 88%] Building C object accel-pppd/CMakeFiles/accel-pppd.dir/cli/tcp.c.o
[ 89%] Building C object accel-pppd/CMakeFiles/accel-pppd.dir/cli/cli.c.o
[ 91%] Building C object accel-pppd/CMakeFiles/accel-pppd.dir/libnetlink/libnetlink.c.o
[ 91%] Building C object accel-pppd/CMakeFiles/accel-pppd.dir/libnetlink/iputils.c.o
[ 92%] Building C object accel-pppd/CMakeFiles/accel-pppd.dir/libnetlink/genl.c.o
[ 93%] Building C object accel-pppd/CMakeFiles/accel-pppd.dir/libnetlink/ipset.c.o
[ 93%] Building C object accel-pppd/CMakeFiles/accel-pppd.dir/pwdb.c.o
[ 94%] Building C object accel-pppd/CMakeFiles/accel-pppd.dir/ipdb.c.o
[ 95%] Building C object accel-pppd/CMakeFiles/accel-pppd.dir/iprange.c.o
[ 96%] Building C object accel-pppd/CMakeFiles/accel-pppd.dir/utils.c.o
[ 97%] Building C object accel-pppd/CMakeFiles/accel-pppd.dir/rbtree.c.o
[ 97%] Building C object accel-pppd/CMakeFiles/accel-pppd.dir/log.c.o
[ 98%] Building C object accel-pppd/CMakeFiles/accel-pppd.dir/main.c.o
/tmp/makepkg/accel-ppp/src/accel-ppp-1.11.2/accel-pppd/main.c: In function ‘close_all_fd’:
/tmp/makepkg/accel-ppp/src/accel-ppp-1.11.2/accel-pppd/main.c:125:3: warning: ‘readdir_r’ is deprecated [-Wdeprecated-declarations]
   if (readdir_r(dirp, &ent, &res))
   ^~
In file included from /tmp/makepkg/accel-ppp/src/accel-ppp-1.11.2/accel-pppd/main.c:11:0:
/usr/include/dirent.h:183:12: note: declared here
 extern int readdir_r (DIR *__restrict __dirp,
            ^~~~~~~~~
At top level:
/tmp/makepkg/accel-ppp/src/accel-ppp-1.11.2/accel-pppd/main.c:55:13: warning: ‘ssl_lock’ defined but not used [-Wunused-function]
 static void ssl_lock(int mode, int type, const char *file, int line)
             ^~~~~~~~
/tmp/makepkg/accel-ppp/src/accel-ppp-1.11.2/accel-pppd/main.c:50:22: warning: ‘ssl_thread_id’ defined but not used [-Wunused-function]
 static unsigned long ssl_thread_id(void)
                      ^~~~~~~~~~~~~
[ 99%] Linking C executable accel-pppd
[ 99%] Built target accel-pppd
make: *** [Makefile:152: all] Error 2
==> ERROR: A failure occurred in build().
    Aborting...
LANG=en_US.UTF-8 makepkg -cf  44,99s user 2,17s system 196% cpu 23,996 total

4le34n
Posts: 10
Joined: 29 Jun 2017, 06:15

Re: 1.11.2 не собираются на последнем Archlinux с опцией сборики -DSHAPER=TRUE

Post by 4le34n » 01 Nov 2017, 08:17

Правда хоть и собирается, но не запускается.
$ sudo cat /var/log/accel-ppp/core.log

Code: Select all

[2017-11-01 18:09:33.403]loader: failed to load 'pptp': /usr/lib64/accel-ppp/libpptp.so: undefined symbol: connlimit_check
[2017-11-01 18:09:33.535]loader: failed to load 'pptp': /usr/lib64/accel-ppp/libpptp.so: undefined symbol: connlimit_check
[2017-11-01 18:09:33.787]loader: failed to load 'pptp': /usr/lib64/accel-ppp/libpptp.so: undefined symbol: connlimit_check
[2017-11-01 18:09:34.36]loader: failed to load 'pptp': /usr/lib64/accel-ppp/libpptp.so: undefined symbol: connlimit_check
[2017-11-01 18:09:34.286]loader: failed to load 'pptp': /usr/lib64/accel-ppp/libpptp.so: undefined symbol: connlimit_check
[2017-11-01 18:10:45.31]loader: failed to load 'ipoe': /usr/lib64/accel-ppp/libipoe.so: undefined symbol: rad_dict_find_attr
[2017-11-01 18:10:45.292]loader: failed to load 'ipoe': /usr/lib64/accel-ppp/libipoe.so: undefined symbol: rad_dict_find_attr
[2017-11-01 18:10:45.540]loader: failed to load 'ipoe': /usr/lib64/accel-ppp/libipoe.so: undefined symbol: rad_dict_find_attr
[2017-11-01 18:10:45.792]loader: failed to load 'ipoe': /usr/lib64/accel-ppp/libipoe.so: undefined symbol: rad_dict_find_attr
[2017-11-01 18:10:46.41]loader: failed to load 'ipoe': /usr/lib64/accel-ppp/libipoe.so: undefined symbol: rad_dict_find_attr


Post Reply

Who is online

Users browsing this forum: No registered users and 1 guest